Target
Thiosulfate sulfurtransferase
Ligand
BDBM50116705
Substrate
Meas. Tech.
ChEMBL_1797977 (CHEMBL4270094)
IC50
>100000±n/a nM
Citation
 Kunkle, TAbdeen, SSalim, NRay, AMStevens, MAmbrose, AJVictorino, JPark, YHoang, QQChapman, EJohnson, SM Hydroxybiphenylamide GroEL/ES Inhibitors Are Potent Antibacterials against Planktonic and Biofilm Forms of Staphylococcus aureus. J Med Chem 61:10651-10664 (2018)  
Target
Name:
Thiosulfate sulfurtransferase
Synonyms:
2.8.1.1 THTR_HUMAN Thiosulfate sulfurtransferase
Type:
PROTEIN
Mol. Mass.:
33432.06
Organism:
Homo sapiens
Description:
ChEMBL_118080
Residue:
297
  
Inhibitor
Name:
BDBM50116705
Synonyms:
CHEMBL460481
Type:
Small organic molecule
Emp. Form.:
C13H10ClNO2
Mol. Mass.:
247.677
SMILES:
Oc1ccccc1C(=O)Nc1cccc(Cl)c1
: