Target
60 kDa heat shock protein, mitochondrial
Ligand
BDBM50468082
Substrate
Meas. Tech.
ChEMBL_1797985 (CHEMBL4270102)
IC50
6900±n/a nM
Citation
 Kunkle, TAbdeen, SSalim, NRay, AMStevens, MAmbrose, AJVictorino, JPark, YHoang, QQChapman, EJohnson, SM Hydroxybiphenylamide GroEL/ES Inhibitors Are Potent Antibacterials against Planktonic and Biofilm Forms of Staphylococcus aureus. J Med Chem 61:10651-10664 (2018)  
Target
Name:
60 kDa heat shock protein, mitochondrial
Synonyms:
3.6.4.9 60 kDa heat shock protein, mitochondrial CPN60 HSP-60 HSP60/HSP10 Heat shock protein 60 Mitochondrial matrix protein P1 | P60 lymphocyte protein
Type:
PROTEIN
Mol. Mass.:
61050.41
Organism:
Homo sapiens
Description:
ChEMBL_117701
Residue:
573
  
Inhibitor
Name:
BDBM50468082
Synonyms:
CHEMBL4293874
Type:
Small organic molecule
Emp. Form.:
C20H12BrClN2O2S2
Mol. Mass.:
491.808
SMILES:
Oc1c(Br)cccc1C(=O)Nc1ccc(Sc2nc3ccccc3s2)c(Cl)c1
: