Target
Epidermal growth factor receptor
Ligand
BDBM50185140
Substrate
Meas. Tech.
ChEMBL_1798330 (CHEMBL4270447)
IC50
38±n/a nM
Citation
 Lu, XZhang, TZhu, SJXun, QTong, LHu, XLi, YChan, SSu, YSun, YChen, YDing, JYun, CHXie, HDing, K Discovery of JND3229 as a New EGFR ACS Med Chem Lett 9:1123-1127 (2018)  
Target
Name:
Epidermal growth factor receptor
Synonyms:
EGF Receptor Substrate EGFR_HUMAN ERBB1 Epidermal Growth Factor Receptor erbB-1 Epidermal growth factor receptor (EGFR) HER1 Proto-oncogene c-ErbB-1 Tyrosine-Protein Kinase ErbB-1
Type:
Receptor Kinase Domain
Mol. Mass.:
134279.59
Organism:
Homo sapiens (Human)
Description:
P00533
Residue:
1210
  
Inhibitor
Name:
BDBM50185140
Synonyms:
AP-26113 US11248003, Example Brigatinib | US20230322822, Compound Brigatinib
Type:
Small organic molecule
Emp. Form.:
C29H39ClN7O2P
Mol. Mass.:
584.092
SMILES:
COc1cc(ccc1Nc1ncc(Cl)c(Nc2ccccc2P(C)(C)=O)n1)N1CCC(CC1)N1CCN(C)CC1
: