Target
Receptor tyrosine-protein kinase erbB-2
Ligand
BDBM50406868
Substrate
Meas. Tech.
ChEMBL_1798893 (CHEMBL4271185)
IC50
14±n/a nM
Citation
 Milik, SNLasheen, DSSerya, RATAbouzid, KAM How to train your inhibitor: Design strategies to overcome resistance to Epidermal Growth Factor Receptor inhibitors. Eur J Med Chem 142:131-151 (2017)  
Target
Name:
Receptor tyrosine-protein kinase erbB-2
Synonyms:
2.7.10.1 CD_antigen=CD340 ERBB2_HUMAN FASN/HER2 HER2 MLN19 NEU Proto-oncogene Neu Tyrosine kinase-type cell surface receptor HER2 | p185erbB2
Type:
Mol. Mass.:
137894.47
Organism:
Homo sapiens (Human)
Description:
P04626
Residue:
1255
  
Inhibitor
Name:
BDBM50406868
Synonyms:
BIBW2992 | CHEMBL2347958
Type:
Small organic molecule
Emp. Form.:
C24H25ClFN5O3
Mol. Mass.:
485.938
SMILES:
CN(C)C\C=C\C(=O)Nc1cc2c(Nc3ccc(F)c(Cl)c3)ncnc2cc1O[C@@H]1CCOC1
: