Target
cAMP-specific 3',5'-cyclic phosphodiesterase 4A
Ligand
BDBM50277665
Substrate
Meas. Tech.
ChEMBL_1801296 (CHEMBL4273588)
IC50
55±n/a nM
Citation
 Raymer, BBhattacharya, SK Lead-like Drugs: A Perspective. J Med Chem 61:10375-10384 (2018)  
Target
Name:
cAMP-specific 3',5'-cyclic phosphodiesterase 4A
Synonyms:
3',5'-cyclic phosphodiesterase PDE46 PDE4A_HUMAN Phosphodiesterase 4A | Phosphodiesterase 4A (PDE4)
Type:
Enzyme
Mol. Mass.:
98113.27
Organism:
Homo sapiens (Human)
Description:
P27815
Residue:
886
  
Inhibitor
Name:
BDBM50277665
Synonyms:
4-(1-hydroxy-1,3-dihydrobenzo[c][1,2]oxaborol-5-yloxy)benzonitrile AN-2728 Crisaborole | Eucrisa
Type:
Small organic molecule
Emp. Form.:
C14H10BNO3
Mol. Mass.:
251.045
SMILES:
OB1OCc2cc(Oc3ccc(cc3)C#N)ccc12
: