Target
ATP-citrate synthase
Ligand
BDBM227589
Substrate
Meas. Tech.
ChEMBL_1803480 (CHEMBL4275772)
Ki
13000±n/a nM
Citation
 Granchi, C ATP citrate lyase (ACLY) inhibitors: An anti-cancer strategy at the crossroads of glucose and lipid metabolism. Eur J Med Chem 157:1276-1291 (2018)  
Target
Name:
ATP-citrate synthase
Synonyms:
ACLY_RAT | Acly
Type:
PROTEIN
Mol. Mass.:
120645.65
Organism:
Rattus norvegicus
Description:
ChEMBL_857791
Residue:
1100
  
Inhibitor
Name:
BDBM227589
Synonyms:
Radicicol
Type:
Small organic molecule
Emp. Form.:
C18H17ClO6
Mol. Mass.:
364.777
SMILES:
C[C@@H]1C[C@H]2O[C@@H]2\C=C/C=C/C(=O)Cc2c(Cl)c(O)cc(O)c2C(=O)O1
: