Target
Mu-type opioid receptor
Ligand
BDBM50469380
Substrate
Meas. Tech.
ChEBML_1804084
Ki
0.037000±n/a nM
Citation
 Martin, CDumitrascuta, MMannes, MLantero, ABucher, DWalker, KVan Wanseele, YOyen, EHernot, SVan Eeckhaut, AMadder, AHoogenboom, RSpetea, MBallet, S Biodegradable Amphipathic Peptide Hydrogels as Extended-Release System for Opioid Peptides. J Med Chem 61:9784-9789 (2018)  
Target
Name:
Mu-type opioid receptor
Synonyms:
M-OR-1 MOR-1 MUOR1 Mu opiate receptor OPRM1 hMOP | mu-type opioid receptor isoform MOR-1
Type:
G Protein-Coupled Receptor (GPCR)
Mol. Mass.:
44789.51
Organism:
Homo sapiens (Human)
Description:
P35372
Residue:
400
  
Inhibitor
Name:
BDBM50469380
Synonyms:
CHEMBL4276875
Type:
Small organic molecule
Emp. Form.:
C35H46N8O5
Mol. Mass.:
658.7903
SMILES:
Cc1cc(O)cc(C)c1C[C@H](N)C(=O)N[C@H](CCCNC(N)=N)C(=O)N[C@@H](Cc1ccccc1)C(=O)N[C@@H](Cc1ccccc1)C(N)=O
: