Target
Gonadotropin-releasing hormone receptor
Ligand
BDBM50469857
Substrate
Meas. Tech.
ChEMBL_100133 (CHEMBL712412)
Ki
0.052481±n/a nM
Citation
 Haviv, FFitzpatrick, TDNichols, CJSwenson, REMort, NABush, ENDiaz, GNguyen, ATHolst, MRCybulski, VA The effect of NMeTyr5 substitution in luteinizing hormone-releasing hormone antagonists. J Med Chem 36:928-33 (1993)  
Target
Name:
Gonadotropin-releasing hormone receptor
Synonyms:
GNRHR_RAT GnRH-R | Gnrhr
Type:
PROTEIN
Mol. Mass.:
37767.60
Organism:
Rattus norvegicus
Description:
ChEMBL_1335047
Residue:
327
  
Inhibitor
Name:
BDBM50469857
Synonyms:
CHEMBL268319
Type:
Small organic molecule
Emp. Form.:
C73H97ClN18O14
Mol. Mass.:
1486.116
SMILES:
[#6]-[#8]-c1ccc(cc1)-[#6](=O)-[#6]-[#6]-[#6@H](-[#7]-[#6](=O)-[#6@H](-[#6]-[#6]-[#6]\[#7]=[#6](\[#7])-[#7])-[#7]-[#6](=O)-[#6@H](-[#6]-[#8])-[#7]-[#6](=O)-[#6@H](-[#6]-c1cccnc1)-[#7]-[#6](=O)-[#6@H](-[#6]-c1ccc(Cl)cc1)-[#7]-[#6](=O)-[#6@H](-[#6]-c1ccc2ccccc2c1)-[#7]-[#6](-[#6])=O)-[#6](=O)-[#7]-[#6@@H](-[#6]-[#6](-[#6])-[#6])-[#6](=O)-[#7]-[#6@@H](-[#6]-[#6]-[#6]\[#7]=[#6](\[#7])-[#7])-[#6](=O)-[#7]-1-[#6]-[#6]-[#6]-[#6@@H]-1-[#6](=O)-[#7]-[#6@@H](-[#6])-[#6](-[#7])=O
: