Target
Substance-P receptor
Ligand
BDBM50470669
Substrate
Meas. Tech.
ChEMBL_205900 (CHEMBL814484)
Ki
0.063096±n/a nM
Citation
 Ward, PArmour, DRBays, DEEvans, BGiblin, GMHeron, NHubbard, TLiang, KMiddlemiss, DMordaunt, J Discovery of an orally bioavailable NK1 receptor antagonist, (2S,3S)-(2-methoxy-5-tetrazol-1-ylbenzyl)(2-phenylpiperidin-3-yl)amine (GR203040), with potent antiemetic activity. J Med Chem 38:4985-92 (1995)  
Target
Name:
Substance-P receptor
Synonyms:
NK-1 receptor NK1 Receptor NK1R_HUMAN Neurokinin-1 (NK-1) SPR TACR1 Tachykinin receptor 1 (NK1) | tachykinin
Type:
G Protein-Coupled Receptor (GPCR)
Mol. Mass.:
46254.43
Organism:
Homo sapiens (Human)
Description:
P25103
Residue:
407
  
Inhibitor
Name:
BDBM50470669
Synonyms:
CHEMBL359188
Type:
Small organic molecule
Emp. Form.:
C24H27N3O
Mol. Mass.:
373.4907
SMILES:
COc1ccc(cc1CN[C@H]1CCCN[C@H]1c1ccccc1)-c1ccncc1
: