Target
5-hydroxytryptamine receptor 1A
Ligand
BDBM50019443
Substrate
Meas. Tech.
ChEMBL_1512 (CHEMBL616344)
Ki
22±n/a nM
Citation
 Gaillard, PCarrupt, PATesta, BSchambel, P Binding of arylpiperazines, (aryloxy)propanolamines, and tetrahydropyridylindoles to the 5-HT1A receptor: contribution of the molecular lipophilicity potential to three-dimensional quantitative structure-affinity relationship models. J Med Chem 39:126-34 (1996)  
Target
Name:
5-hydroxytryptamine receptor 1A
Synonyms:
5-HT-1A 5-HT1A 5-hydroxytryptamine receptor 1A (5HT1A) 5ht1a Htr1a Serotonin 1a (5-HT1a) receptor/Adrenergic receptor alpha-1 | Serotonin receptor 1A
Type:
G Protein-Coupled Receptor (GPCR)
Mol. Mass.:
46445.29
Organism:
Rattus norvegicus (rat)
Description:
Binding assays were performed using rat hippocampal membranes.
Residue:
422
  
Inhibitor
Name:
BDBM50019443
Synonyms:
1-(1H-Indol-4-yloxy)-3-isopropylamino-propan-2-ol 1-(1H-Indol-4-yloxy)-3-isopropylamino-propan-2-ol(pindolol) LB-46 PINDOLOL,(-) VISKAZIDE | VISKEN
Type:
Small organic molecule
Emp. Form.:
C14H20N2O2
Mol. Mass.:
248.3208
SMILES:
CC(C)NCC(O)COc1cccc2[nH]ccc12
: