Target
5-hydroxytryptamine receptor 2C
Ligand
BDBM50144841
Substrate
Meas. Tech.
ChEMBL_2746 (CHEMBL617508)
Ki
1.3±n/a nM
Citation
 Bös, MJenck, FMartin, JRMoreau, JLSleight, AJWichmann, JWidmer, U Novel agonists of 5HT2C receptors. Synthesis and biological evaluation of substituted 2-(indol-1-yl)-1-methylethylamines and 2-(indeno[1,2-b]pyrrol-1-yl)-1-methylethylamines. Improved therapeutics for obsessive compulsive disorder. J Med Chem 40:2762-9 (1997)  
Target
Name:
5-hydroxytryptamine receptor 2C
Synonyms:
5-HT-2C 5-HT2C-INI 5-HTR2C 5-hydroxytryptamine receptor 2C (5-HT-2C) 5HT-1C HTR1C Serotonin (5-HT3) receptor Serotonin Receptor 2C
Type:
G Protein-Coupled Receptor (GPCR)
Mol. Mass.:
51836.79
Organism:
Homo sapiens (Human)
Description:
P28335
Residue:
458
  
Inhibitor
Name:
BDBM50144841
Synonyms:
(S)-1-(6-chloro-5-fluoro-1H-indol-1-yl)propan-2-amine CHEMBL76781 Ro-600175
Type:
Small organic molecule
Emp. Form.:
C11H12ClFN2
Mol. Mass.:
226.678
SMILES:
C[C@H](N)Cn1ccc2cc(F)c(Cl)cc12
: