Target
Type-1 angiotensin II receptor A/B
Ligand
BDBM50228196
Substrate
Meas. Tech.
ChEMBL_34974 (CHEMBL649503)
IC50
2.9±n/a nM
Citation
 Schmidt, BLindman, STong, WLindeberg, GGogoll, ALai, ZThörnwall, MSynnergren, BNilsson, AWelch, CJSohtell, MWesterlund, CNyberg, FKarlén, AHallberg, A Design, synthesis, and biological activities of four angiotensin II receptor ligands with gamma-turn mimetics replacing amino acid residues 3-5. J Med Chem 40:903-19 (1997)  
Target
Name:
Type-1 angiotensin II receptor A/B
Synonyms:
Angiotensin II receptor (AT-1) type-1 | Type-1A/Type-1B angiotensin II receptor
Type:
Mol. Mass.:
Description:
ASSAY_ID of ChEMBL is 901964
Components:
This complex has 2 components.
Component 1
Name:
Type-1 angiotensin II receptor B
Synonyms:
AGTRB_RAT Agtr1 Angiotensin II AT1B Angiotensin II type 1b (AT-1b) receptor Type-1B angiotensin II receptor
Type:
Enzyme Catalytic Domain
Mol. Mass.:
40929.44
Organism:
RAT
Description:
Angiotensin II AT1B 0 RAT::P29089
Residue:
359
  
Component 2
Name:
Type-1 angiotensin II receptor A
Synonyms:
AGTRA_RAT Agtr1 Angiotensin II AT1 Angiotensin II receptor (AT-1) type-1 Type-1A angiotensin II receptor
Type:
Enzyme Catalytic Domain
Mol. Mass.:
40910.53
Organism:
RAT
Description:
ANGIOTENSIN AT1 AGTR1 RAT::P25095
Residue:
359
  
Inhibitor
Name:
BDBM50228196
Synonyms:
CHEMBL405464
Type:
Small organic molecule
Emp. Form.:
C45H59N13O12S2
Mol. Mass.:
1038.16
SMILES:
N[C@@H](CC(O)=O)C(=O)N[C@@H](CCCN=C(N)N)C(=O)N[C@H]1CSSC[C@H](NC(=O)[C@H](Cc2ccc(O)cc2)NC1=O)C(=O)N[C@@H](Cc1c[nH]cn1)C(=O)N1CCC[C@H]1C(=O)N[C@@H](Cc1ccccc1)C(O)=O
: