Target
Estrogen receptor beta
Ligand
BDBM50471594
Substrate
Meas. Tech.
ChEMBL_103299 (CHEMBL712253)
IC50
3100±n/a nM
Citation
 Gilbert, JFuentes, MOjasoo, TDoré, JCPons, M Cytotoxicity and antiestrogenicity of a novel series of basic diphenylethylenes. J Med Chem 40:1104-11 (1997)  
Target
Name:
Estrogen receptor beta
Synonyms:
Estrogen receptor
Type:
Mol. Mass.:
Description:
ASSAY_ID of ChEMBL is 99778
Components:
This complex has 2 components.
Component 1
Name:
Estrogen receptor beta
Synonyms:
ER-beta ESR2_HUMAN Estradiol receptor beta (ERβ) Estrogen receptor (ER beta) Estrogen receptor beta (ER beta) NR3A2 estrogen beta
Type:
Protein
Mol. Mass.:
59238.43
Organism:
Homo sapiens (Human)
Description:
Q92731
Residue:
530
  
Component 2
Name:
Estrogen receptor
Synonyms:
ER ESR ESR1_HUMAN Estrogen receptor Estrogen receptor (ER-alpha) Estrogen receptor alpha (ER) Nuclear receptor subfamily 3 group A member 1
Type:
Protein
Mol. Mass.:
66230.44
Organism:
Homo sapiens (Human)
Description:
P03372
Residue:
595
  
Inhibitor
Name:
BDBM50471594
Synonyms:
CHEMBL13163
Type:
Small organic molecule
Emp. Form.:
C33H52N2O2
Mol. Mass.:
508.7782
SMILES:
[#6]-[#6](-[#6])\[#6]=[#6](/c1ccc(-[#8]-[#6]-[#6]-[#7](-[#6](-[#6])-[#6])-[#6](-[#6])-[#6])cc1)-c1ccc(-[#8]-[#6]-[#6]-[#7](-[#6](-[#6])-[#6])-[#6](-[#6])-[#6])cc1
: