Target
[Pyruvate dehydrogenase (acetyl-transferring)] kinase isozyme 1,/2,/3,/4, mitochondrial
Ligand
BDBM50472671
Substrate
Meas. Tech.
ChEMBL_160234 (CHEMBL769458)
IC50
16±n/a nM
Citation
 Bebernitz, GRAicher, TDStanton, JLGao, JShetty, SSKnorr, DCStrohschein, RJTan, JBrand, LJLiu, CWang, WHVinluan, CCKaplan, ELDragland, CJDelGrande, DIslam, ALozito, RJLiu, XManiara, WMMann, WR Anilides of (R)-trifluoro-2-hydroxy-2-methylpropionic acid as inhibitors of pyruvate dehydrogenase kinase. J Med Chem 43:2248-57 (2000)  
Target
Name:
[Pyruvate dehydrogenase (acetyl-transferring)] kinase isozyme 1,/2,/3,/4, mitochondrial
Synonyms:
Pyruvate dehydrogenase kinase
Type:
Mol. Mass.:
Description:
ASSAY_ID of ChEMBL is 160230
Components:
This complex has 4 components.
Component 1
Name:
[Pyruvate dehydrogenase (acetyl-transferring)] kinase isozyme 1, mitochondrial
Synonyms:
PDHK1 PDK1_HUMAN Pyruvate dehydrogenase kinase 1 (PDK1) | Pyruvate dehydrogenase kinase isoform 1
Type:
Protein
Mol. Mass.:
49255.23
Organism:
Homo sapiens (Human)
Description:
Q15118
Residue:
436
  
Component 2
Name:
[Pyruvate dehydrogenase (acetyl-transferring)] kinase isozyme 4, mitochondrial
Synonyms:
PDHK4 PDK4_HUMAN Pyruvate dehydrogenase kinase 4 (PDK4) | Pyruvate dehydrogenase kinase isoform 4
Type:
Enzyme
Mol. Mass.:
46469.71
Organism:
Homo sapiens (Human)
Description:
Q16654
Residue:
411
  
Component 3
Name:
[Pyruvate dehydrogenase (acetyl-transferring)] kinase isozyme 2, mitochondrial
Synonyms:
PDHK2 PDK2_HUMAN Pyruvate dehydrogenase kinase isoenzyme 1 (PDK2)
Type:
Enzyme
Mol. Mass.:
46153.78
Organism:
Homo sapiens (Human)
Description:
Q15119
Residue:
407
  
Component 4
Name:
[Pyruvate dehydrogenase (acetyl-transferring)] kinase isozyme 3, mitochondrial
Synonyms:
PDHK3 PDK3_HUMAN Pyruvate dehydrogenase kinase 3 (PDK3) [Pyruvate dehydrogenase (acetyl-transferring)] kinase isozyme 3, mitochondrial
Type:
Enzyme
Mol. Mass.:
46944.89
Organism:
Homo sapiens (Human)
Description:
Q15120
Residue:
406
  
Inhibitor
Name:
BDBM50472671
Synonyms:
CHEMBL450618
Type:
Small organic molecule
Emp. Form.:
C18H19ClF3N3O6S2
Mol. Mass.:
529.938
SMILES:
C[C@@](O)(C(=O)Nc1ccc(cc1Cl)S(=O)(=O)NS(=O)(=O)c1ccc(CCN)cc1)C(F)(F)F
: