Target
Cannabinoid receptor 1
Ligand
BDBM50318484
Substrate
Meas. Tech.
ChEMBL_46468 (CHEMBL858761)
Ki
4400±n/a nM
Citation
 Fichera, MCruciani, GBianchi, AMusumarra, G A 3D-QSAR study on the structural requirements for binding to CB(1) and CB(2) cannabinoid receptors. J Med Chem 43:2300-9 (2000)  
Target
Name:
Cannabinoid receptor 1
Synonyms:
CANN6 CB-R CNR CNR1_HUMAN Cannabinoid receptor Cannabinoid receptor 1 (brain)
Type:
G Protein-Coupled Receptor (GPCR)
Mol. Mass.:
52868.96
Organism:
Homo sapiens (Human)
Description:
P21554
Residue:
472
  
Inhibitor
Name:
BDBM50318484
Synonyms:
2-((1R,6R)-6-Isopropenyl-3-methyl-cyclohex-2-enyl)-5-pentyl-benzene-1,3-diol CHEMBL190461
Type:
Small organic molecule
Emp. Form.:
C21H30O2
Mol. Mass.:
314.4617
SMILES:
CCCCCc1cc(O)c([C@@H]2C=C(C)CC[C@H]2C(C)=C)c(O)c1
: