Target
[Pyruvate dehydrogenase (acetyl-transferring)] kinase isozyme 4, mitochondrial
Ligand
BDBM50472831
Substrate
Meas. Tech.
ChEMBL_152460 (CHEMBL761449)
IC50
25±n/a nM
Citation
 Aicher, TDAnderson, RCGao, JShetty, SSCoppola, GMStanton, JLKnorr, DCSperbeck, DMBrand, LJVinluan, CCKaplan, ELDragland, CJTomaselli, HCIslam, ALozito, RJLiu, XManiara, WMFillers, WSDelGrande, DWalter, REMann, WR Secondary amides of (R)-3,3,3-trifluoro-2-hydroxy-2-methylpropionic acid as inhibitors of pyruvate dehydrogenase kinase. J Med Chem 43:236-49 (2000)  
Target
Name:
[Pyruvate dehydrogenase (acetyl-transferring)] kinase isozyme 4, mitochondrial
Synonyms:
2.7.11.2 Pdk4 [Pyruvate dehydrogenase (acetyl-transferring)] kinase isozyme 4, mitochondrial
Type:
PROTEIN
Mol. Mass.:
46681.07
Organism:
Rattus norvegicus
Description:
ChEMBL_104818
Residue:
412
  
Inhibitor
Name:
BDBM50472831
Synonyms:
CHEMBL84271
Type:
Small organic molecule
Emp. Form.:
C19H21F3N2O4S
Mol. Mass.:
430.441
SMILES:
C[C@@H]1CN(CCN1S(=O)(=O)c1cccc2ccccc12)C(=O)[C@@](C)(O)C(F)(F)F
: