Target
[Pyruvate dehydrogenase (acetyl-transferring)] kinase isozyme 4, mitochondrial
Ligand
BDBM50472842
Substrate
Meas. Tech.
ChEMBL_152460 (CHEMBL761449)
IC50
64±n/a nM
Citation
 Aicher, TDAnderson, RCGao, JShetty, SSCoppola, GMStanton, JLKnorr, DCSperbeck, DMBrand, LJVinluan, CCKaplan, ELDragland, CJTomaselli, HCIslam, ALozito, RJLiu, XManiara, WMFillers, WSDelGrande, DWalter, REMann, WR Secondary amides of (R)-3,3,3-trifluoro-2-hydroxy-2-methylpropionic acid as inhibitors of pyruvate dehydrogenase kinase. J Med Chem 43:236-49 (2000)  
Target
Name:
[Pyruvate dehydrogenase (acetyl-transferring)] kinase isozyme 4, mitochondrial
Synonyms:
2.7.11.2 Pdk4 [Pyruvate dehydrogenase (acetyl-transferring)] kinase isozyme 4, mitochondrial
Type:
PROTEIN
Mol. Mass.:
46681.07
Organism:
Rattus norvegicus
Description:
ChEMBL_104818
Residue:
412
  
Inhibitor
Name:
BDBM50472842
Synonyms:
CHEMBL314190
Type:
Small organic molecule
Emp. Form.:
C16H25F3N2O3
Mol. Mass.:
350.3765
SMILES:
C[C@@H]1CN(CCN1C(=O)C1CCCCC1)C(=O)[C@@](C)(O)C(F)(F)F
: