Target
Substance-K receptor
Ligand
BDBM50472912
Substrate
Meas. Tech.
ChEMBL_209209 (CHEMBL818003)
Ki
7.9±n/a nM
Citation
 Giannotti, DPerrotta, EDi Bugno, CNannicini, RHarmat, NJGiolitti, APatacchini, RRenzetti, ARRotondaro, LGiuliani, SAltamura, MMaggi, CA Discovery of potent cyclic pseudopeptide human tachykinin NK-2 receptor antagonists. J Med Chem 43:4041-4 (2000)  
Target
Name:
Substance-K receptor
Synonyms:
NK-2 receptor NK2R NKNAR Neurokinin A receptor Neurokinin-2 (NK-2) SKR TACR2 Tachykinin receptor 2 (NK2) | hnk-3
Type:
Protein
Mol. Mass.:
44455.78
Organism:
Homo sapiens (Human)
Description:
P21452
Residue:
398
  
Inhibitor
Name:
BDBM50472912
Synonyms:
CHEMBL116564 | MEN-11712
Type:
Small organic molecule
Emp. Form.:
C37H37N5O4
Mol. Mass.:
615.7208
SMILES:
O=C1CCC(=O)N[C@@H](Cc2c[nH]c3ccccc23)C(=O)N[C@@H](Cc2ccccc2)C(=O)N[C@H](Cc2ccc3ccccc3c2)CN1
: