Target
Substance-K receptor
Ligand
BDBM50472913
Substrate
Meas. Tech.
ChEMBL_209209 (CHEMBL818003)
Ki
20±n/a nM
Citation
 Giannotti, DPerrotta, EDi Bugno, CNannicini, RHarmat, NJGiolitti, APatacchini, RRenzetti, ARRotondaro, LGiuliani, SAltamura, MMaggi, CA Discovery of potent cyclic pseudopeptide human tachykinin NK-2 receptor antagonists. J Med Chem 43:4041-4 (2000)  
Target
Name:
Substance-K receptor
Synonyms:
NK-2 receptor NK2R NKNAR Neurokinin A receptor Neurokinin-2 (NK-2) SKR TACR2 Tachykinin receptor 2 (NK2) | hnk-3
Type:
Protein
Mol. Mass.:
44455.78
Organism:
Homo sapiens (Human)
Description:
P21452
Residue:
398
  
Inhibitor
Name:
BDBM50472913
Synonyms:
CHEMBL2112675
Type:
Small organic molecule
Emp. Form.:
C34H34F3N5O4
Mol. Mass.:
633.6601
SMILES:
FC(F)(F)c1ccc(C[C@@H]2CNC(=O)CCC(=O)N[C@@H](Cc3c[nH]c4ccccc34)C(=O)N[C@@H](Cc3ccccc3)C(=O)N2)cc1
: