Target
5-hydroxytryptamine receptor 7
Ligand
BDBM21342
Substrate
Meas. Tech.
ChEMBL_3712 (CHEMBL618164)
Ki
6.3±n/a nM
Citation
 Vázquez, MJRoa, AMReyes, FVega, ARivera-Sagredo, AThomas, DRDíez, EHueso-Rodríguez, JA A novel ergot alkaloid as a 5-HT(1A) inhibitor produced by Dicyma sp. J Med Chem 46:5117-20 (2003)  
Target
Name:
5-hydroxytryptamine receptor 7
Synonyms:
5-HT-7 5-HT7 5-HT7S 5HT7 HTR7 | Serotonin receptor 7
Type:
G Protein-Coupled Receptor (GPCR)
Mol. Mass.:
53573.08
Organism:
Homo sapiens (Human)
Description:
P34969
Residue:
479
  
Inhibitor
Name:
BDBM21342
Synonyms:
(4R,7R)-N,N-diethyl-6-methyl-6,11-diazatetracyclo[7.6.1.0^{2,7}.0^{12,16}]hexadeca-1(16),2,9,12,14-pentaene-4-carboxamide LSD LSD,(+) Lysergic Acid Diethylamide [3H]-LSD | d-Isolysergic acid amide
Type:
radiolabeled ligand
Emp. Form.:
C20H25N3O
Mol. Mass.:
323.432
SMILES:
[H][C@@]12Cc3c[nH]c4cccc(C1=C[C@H](CN2C)C(=O)N(CC)CC)c34
: