Target
D(2) dopamine receptor
Ligand
BDBM50185474
Substrate
Meas. Tech.
ChEMBL_60398 (CHEMBL672843)
Ki
7.48±n/a nM
Citation
 Lyles-Eggleston, MAltundas, RXia, JSikazwe, DMFan, PYang, QLi, SZhang, WZhu, XSchmidt, AWVanase-Frawley, MShrihkande, AVillalobos, ABorne, RFAblordeppey, SY Design, synthesis, and evaluation of metabolism-based analogues of haloperidol incapable of forming MPP+-like species. J Med Chem 47:497-508 (2004)  
Target
Name:
D(2) dopamine receptor
Synonyms:
D(2) dopamine receptor DOPAMINE D2 Long DRD2 Dopamine D2 receptor Dopamine D2 receptor (D2R) Dopamine2-like | d2
Type:
Cell-surface receptors
Mol. Mass.:
50647.10
Organism:
Homo sapiens (Human)
Description:
P14416
Residue:
443
  
Inhibitor
Name:
BDBM50185474
Synonyms:
(+)-4-(3-(4-chlorophenyl)-3-hydroxypyrrolidin-1-yl)-1-(4-fluorophenyl)butan-1-one (-)-4-(3-(4-chlorophenyl)-3-hydroxypyrrolidin-1-yl)-1-(4-fluorophenyl)butan-1-one 4-(3-(4-chlorophenyl)-3-hydroxypyrrolidin-1-yl)-1-(4-fluorophenyl)butan-1-one 4-{3-(4-chlorophenyl)-3-hydroxypyrrolidin-1-yl}-1-(4-fluorophenyl)butan-1-one | CHEMBL150161
Type:
Small organic molecule
Emp. Form.:
C20H21ClFNO2
Mol. Mass.:
361.838
SMILES:
OC1(CCN(CCCC(=O)c2ccc(F)cc2)C1)c1ccc(Cl)cc1
: