Target
C-X-C chemokine receptor type 1/2
Ligand
BDBM50169047
Substrate
Meas. Tech.
ChEMBL_312518 (CHEMBL833397)
IC50
100±n/a nM
Citation
 Allegretti, MBertini, RCesta, MCBizzarri, CDi Bitondo, RDi Cioccio, VGalliera, EBerdini, VTopai, AZampella, GRusso, VDi Bello, NNano, GNicolini, LLocati, MFantucci, PFlorio, SColotta, F 2-Arylpropionic CXC chemokine receptor 1 (CXCR1) ligands as novel noncompetitive CXCL8 inhibitors. J Med Chem 48:4312-31 (2005)  
Target
Name:
C-X-C chemokine receptor type 1/2
Synonyms:
Interleukin-8 receptors, CXCR1/CXCR2
Type:
Mol. Mass.:
Description:
ASSAY_ID of ChEMBL is 89096
Components:
This complex has 2 components.
Component 1
Name:
C-X-C chemokine receptor type 1
Synonyms:
C-X-C chemokine receptor type 1 (CXCR-1) CMKAR1 CXCR1_HUMAN Interleukin-8 receptor A | Interleukin-8 receptors, CXCR1/CXCR2
Type:
Enzyme
Mol. Mass.:
39803.83
Organism:
Homo sapiens (Human)
Description:
P25024
Residue:
350
  
Component 2
Name:
C-X-C chemokine receptor type 2
Synonyms:
C-X-C chemokine receptor type 2 (CXCR-2) CD_antigen=CD182 CXCR-2 CXCR2_HUMAN GRO/MGSA receptor IL-8 receptor type 2 IL8RB | Interleukin-8 receptor B
Type:
Protein
Mol. Mass.:
40767.88
Organism:
Homo sapiens (Human)
Description:
P25025
Residue:
360
  
Inhibitor
Name:
BDBM50169047
Synonyms:
(S)-2-(4-Isobutyl-phenyl)-propionic acid (S)-ibuprofen DEXIBUPROFEN | IBUPROFEN LYSINE
Type:
Small organic molecule
Emp. Form.:
C13H18O2
Mol. Mass.:
206.2808
SMILES:
CC(C)Cc1ccc(cc1)[C@H](C)C(O)=O
: