Target
Kappa-type opioid receptor
Ligand
BDBM82551
Substrate
Meas. Tech.
ChEMBL_303356 (CHEMBL838691)
Ki
0.400000±n/a nM
Citation
 Chauvignac, CMiller, CNSrivastava, SKLewis, JWHusbands, SMTraynor, JR Major effect of pyrrolic N-benzylation in norbinaltorphimine, the selective kappa-opioid receptor antagonist. J Med Chem 48:1676-9 (2005)  
Target
Name:
Kappa-type opioid receptor
Synonyms:
K-OR-1 Kappa-opioid receptor (KOR) Kappa-type opioid receptor (KOR) OPIATE Kappa OPRK1 kappa opioid receptor (KOR)
Type:
G Protein-Coupled Receptor (GPCR)
Mol. Mass.:
42648.76
Organism:
Homo sapiens (Human)
Description:
P41145
Residue:
380
  
Inhibitor
Name:
BDBM82551
Synonyms:
C18130 NOR-BNI (HCI)2 | NORBNI
Type:
Small organic molecule
Emp. Form.:
C40H43N3O6
Mol. Mass.:
661.7859
SMILES:
Oc1ccc2C[C@H]3N(CC4CC4)CC[C@@]45[C@@H](Oc1c24)c1[nH]c2[C@@H]4Oc6c7c(C[C@H]8N(CC9CC9)CC[C@@]47[C@@]8(O)Cc2c1C[C@@]35O)ccc6O
: