Target
Alpha-1D adrenergic receptor
Ligand
BDBM50023200
Substrate
Meas. Tech.
ChEMBL_425084 (CHEMBL913649)
Ki
0.398107±n/a nM
Citation
 Romeo, GMateria, LMarucci, GModica, MPittalą, VSalerno, LSiracusa, MABuccioni, MAngeli, PMinneman, KP New pyrimido[5,4-b]indoles and [1]benzothieno[3,2-d]pyrimidines: high affinity ligands for the alpha(1)-adrenoceptor subtypes. Bioorg Med Chem Lett 16:6200-3 (2006)  
Target
Name:
Alpha-1D adrenergic receptor
Synonyms:
ADA1D_HUMAN ADRA1D Adrenergic receptor alpha Alpha 1D-adrenoreceptor Alpha-1D adrenoceptor adrenergic Alpha1D
Type:
Enzyme Catalytic Domain
Mol. Mass.:
60485.82
Organism:
Homo sapiens (Human)
Description:
adrenergic Alpha1D ADRA1D HUMAN::P25100
Residue:
572
  
Inhibitor
Name:
BDBM50023200
Synonyms:
CHEMBL220221
Type:
Small organic molecule
Emp. Form.:
C24H26N4O2S
Mol. Mass.:
434.554
SMILES:
COc1ccccc1N1CCN(CCn2c(C)nc3c4ccccc4sc3c2=O)CC1
: