Target
Integrin alpha-V/beta-3
Ligand
BDBM50476090
Substrate
Meas. Tech.
ChEMBL_425102 (CHEMBL913667)
IC50
18300±n/a nM
Citation
 Zeng, GZTan, NHHao, XJMu, QZLi, RT Natural inhibitors targeting osteoclast-mediated bone resorption. Bioorg Med Chem Lett 16:6178-80 (2006)  
Target
Name:
Integrin alpha-V/beta-3
Synonyms:
ITGAV/ITGB3 | Integrin beta-3/Vitronectin receptor alpha
Type:
Enzyme
Mol. Mass.:
Description:
Components:
This complex has 2 components.
Component 1
Name:
Integrin alpha-V
Synonyms:
ITAV_HUMAN Integrin alpha-V/alpha-5 VNRA Vitronectin receptor | Vitronectin receptor subunit alpha
Type:
PROTEIN
Mol. Mass.:
116024.92
Organism:
Homo sapiens (Human)
Description:
ChEMBL_582336
Residue:
1048
  
Component 2
Name:
Integrin beta-3
Synonyms:
CD_antigen=CD61 GPIIIa ITGB3 Platelet membrane glycoprotein IIIa
Type:
Protein
Mol. Mass.:
87038.91
Organism:
Homo sapiens (Human)
Description:
P05106
Residue:
788
  
Inhibitor
Name:
BDBM50476090
Synonyms:
CHEBI:17531 | MELILOTOSIDE
Type:
Small organic molecule
Emp. Form.:
C15H18O8
Mol. Mass.:
326.2986
SMILES:
OC[C@H]1O[C@@H](Oc2ccccc2\C=C\C(O)=O)[C@H](O)[C@@H](O)[C@@H]1O
: