Target
Substance-K receptor
Ligand
BDBM50476219
Substrate
Meas. Tech.
ChEMBL_430641 (CHEMBL918150)
Ki
0.100000±n/a nM
Citation
 Fedi, VAltamura, MBalacco, GCanfarini, FCriscuoli, MGiannotti, DGiolitti, AGiuliani, SGuidi, AHarmat, NJNannicini, RPasqui, FPatacchini, RPerrotta, ETramontana, MTriolo, AMaggi, CA Insertion of an aspartic acid moiety into cyclic pseudopeptides: synthesis and biological characterization of potent antagonists for the human Tachykinin NK-2 receptor. J Med Chem 47:6935-47 (2004)  
Target
Name:
Substance-K receptor
Synonyms:
NK-2 receptor NK2R NKNAR Neurokinin A receptor Neurokinin-2 (NK-2) SKR TACR2 Tachykinin receptor 2 (NK2) | hnk-3
Type:
Protein
Mol. Mass.:
44455.78
Organism:
Homo sapiens (Human)
Description:
P21452
Residue:
398
  
Inhibitor
Name:
BDBM50476219
Synonyms:
CHEMBL225297
Type:
Small organic molecule
Emp. Form.:
C39H47N9O7S
Mol. Mass.:
785.912
SMILES:
NS(=O)(=O)N1CCN(CC(=O)N[C@@H]2CC(=O)N[C@@H](Cc3c[nH]c4ccccc34)C(=O)N[C@@H](Cc3ccccc3)C(=O)N[C@H](Cc3ccccc3)CNC2=O)CC1
: