Target
Substance-K receptor
Ligand
BDBM50476793
Substrate
Meas. Tech.
ChEMBL_446257 (CHEMBL895361)
Ki
0.131826±n/a nM
Citation
 Fedi, VAltamura, MCatalioto, RMGiannotti, DGiolitti, AGiuliani, SGuidi, AHarmat, NJLecci, AMeini, SNannicini, RPasqui, FTramontana, MTriolo, AMaggi, CA Discovery of a new series of potent and selective linear tachykinin NK2 receptor antagonists. J Med Chem 50:4793-807 (2007)  
Target
Name:
Substance-K receptor
Synonyms:
NK-2 receptor NK2R NKNAR Neurokinin A receptor Neurokinin-2 (NK-2) SKR TACR2 Tachykinin receptor 2 (NK2) | hnk-3
Type:
Protein
Mol. Mass.:
44455.78
Organism:
Homo sapiens (Human)
Description:
P21452
Residue:
398
  
Inhibitor
Name:
BDBM50476793
Synonyms:
CHEMBL394780
Type:
Small organic molecule
Emp. Form.:
C31H40N6O5S2
Mol. Mass.:
640.817
SMILES:
NS(=O)(=O)N1CCN(CCCNC(=O)[C@@H](Cc2ccccc2)NC(=O)C2(CCCC2)NC(=O)c2cc3ccccc3s2)CC1
: