Target
5-hydroxytryptamine receptor 2C
Ligand
BDBM50048803
Substrate
Meas. Tech.
ChEMBL_446511 (CHEMBL895623)
Ki
1.3±n/a nM
Citation
 Lange, JHReinders, JHTolboom, JTGlennon, JCCoolen, HKKruse, CG Principal component analysis differentiates the receptor binding profiles of three antipsychotic drug candidates from current antipsychotic drugs. J Med Chem 50:5103-8 (2007)  
Target
Name:
5-hydroxytryptamine receptor 2C
Synonyms:
5-HT-2C 5-HT2C-INI 5-HTR2C 5-hydroxytryptamine receptor 2C (5-HT-2C) 5HT-1C HTR1C Serotonin (5-HT3) receptor Serotonin Receptor 2C
Type:
G Protein-Coupled Receptor (GPCR)
Mol. Mass.:
51836.79
Organism:
Homo sapiens (Human)
Description:
P28335
Residue:
458
  
Inhibitor
Name:
BDBM50048803
Synonyms:
5-(2-(4-(benzo[d]isothiazol-3-yl)piperazin-1-yl)ethyl)-6-chloroindolin-2-one 5-[2-(4-Benzo[d]isothiazol-3-yl-piperazin-1-yl)-ethyl]-6-chloro-1,3-dihydro-indol-2-one (Ziprasidone) CHEMBL708 ZIPRASIDONE | ZIPRASIDONE HYDROCHLORIDE
Type:
Small organic molecule
Emp. Form.:
C21H21ClN4OS
Mol. Mass.:
412.936
SMILES:
Clc1cc2NC(=O)Cc2cc1CCN1CCN(CC1)c1nsc2ccccc12
: