Target
Cytochrome P450 11B1, mitochondrial
Ligand
BDBM50028160
Substrate
Meas. Tech.
ChEBML_192
IC50
7050±n/a nM
Citation
 Hays, SJTobes, MCGildersleeve, DLWieland, DMBeierwaltes, WH Structure-activity relationship study of the inhibition of adrenal cortical 11 beta-hydroxylase by new metyrapone analogues. J Med Chem 27:15-9 (1984)  
Target
Name:
Cytochrome P450 11B1, mitochondrial
Synonyms:
C11B1_BOVIN Cytochrome P450 11B1
Type:
PROTEIN
Mol. Mass.:
57863.81
Organism:
Bos taurus
Description:
ChEMBL_1345884
Residue:
503
  
Inhibitor
Name:
BDBM50028160
Synonyms:
2-Methyl-1,2-di-pyridin-3-yl-propan-1-ol CHEMBL933 Metyrapol (MPOL)
Type:
Small organic molecule
Emp. Form.:
C14H16N2O
Mol. Mass.:
228.2896
SMILES:
CC(C)(C(O)c1cccnc1)c1cccnc1
: