Target
5-hydroxytryptamine receptor 2A
Ligand
BDBM50144841
Substrate
Meas. Tech.
ChEMBL_460518 (CHEMBL926598)
EC50
50±n/a nM
Citation
 Smith, BMSmith, JMTsai, JHSchultz, JAGilson, CAEstrada, SAChen, RRPark, DMPrieto, EBGallardo, CSSengupta, DDosa, PICovel, JARen, AWebb, RRBeeley, NRMartin, MMorgan, MEspitia, SSaldana, HRBjenning, CWhelan, KTGrottick, AJMenzaghi, FThomsen, WJ Discovery and structure-activity relationship of (1R)-8-chloro-2,3,4,5-tetrahydro-1-methyl-1H-3-benzazepine (Lorcaserin), a selective serotonin 5-HT2C receptor agonist for the treatment of obesity. J Med Chem 51:305-13 (2008)  
Target
Name:
5-hydroxytryptamine receptor 2A
Synonyms:
5-HT-2 5-HT2A 5-hydroxytryptamine receptor 2A (5HT-2A) 5HT2A_HUMAN HTR2A | Serotonin receptor 2A
Type:
undefined
Mol. Mass.:
52607.65
Organism:
Homo sapiens (Human)
Description:
P28223
Residue:
471
  
Inhibitor
Name:
BDBM50144841
Synonyms:
(S)-1-(6-chloro-5-fluoro-1H-indol-1-yl)propan-2-amine CHEMBL76781 Ro-600175
Type:
Small organic molecule
Emp. Form.:
C11H12ClFN2
Mol. Mass.:
226.678
SMILES:
C[C@H](N)Cn1ccc2cc(F)c(Cl)cc12
: