Target
Reverse transcriptase
Ligand
BDBM50478100
Substrate
Meas. Tech.
ChEMBL_468352 (CHEMBL931815)
IC50
1900±n/a nM
Citation
 Boojamra, CGMackman, RLMarkevitch, DYPrasad, VRay, ASDouglas, JGrant, DKim, CUCihlar, T Synthesis and anti-HIV activity of GS-9148 (2'-Fd4AP), a novel nucleoside phosphonate HIV reverse transcriptase inhibitor. Bioorg Med Chem Lett 18:1120-3 (2008)  
Target
Name:
Reverse transcriptase
Synonyms:
Type:
Protein
Mol. Mass.:
29598.37
Organism:
Human immunodeficiency virus 1
Description:
Q9WKE8
Residue:
254
  
Inhibitor
Name:
BDBM50478100
Synonyms:
CHEMBL252036 | GS-9148
Type:
Small organic molecule
Emp. Form.:
C10H11FN5O5P
Mol. Mass.:
331.197
SMILES:
Nc1ncnc2n(cnc12)[C@@H]1O[C@H](OCP(O)(O)=O)C=C1F
: