Target
Reverse transcriptase protein
Ligand
BDBM50478974
Substrate
Meas. Tech.
ChEMBL_490001 (CHEMBL984664)
Ki
150±n/a nM
Citation
 Marchand, BWhite, KLLy, JKMargot, NAWang, RMcDermott, MMiller, MDGötte, M Effects of the translocation status of human immunodeficiency virus type 1 reverse transcriptase on the efficiency of excision of tenofovir. Antimicrob Agents Chemother 51:2911-9 (2007)  
Target
Name:
Reverse transcriptase protein
Synonyms:
Reverse Transcriptase Reverse Transcriptase (F61A)
Type:
Protein
Mol. Mass.:
30203.56
Organism:
Human immunodeficiency virus 1
Description:
Q9WJQ2
Residue:
259
  
Inhibitor
Name:
BDBM50478974
Synonyms:
CHEMBL1162284
Type:
Small organic molecule
Emp. Form.:
C10H16N8O14P4
Mol. Mass.:
596.1743
SMILES:
Nc1ncnc2n(cnc12)[C@H]1C[C@H](N=[N+]=[N-])[C@@H](COP(O)(=O)OP(O)(=O)OP(O)(=O)OP(O)(O)=O)O1
: