Target
Reverse transcriptase
Ligand
BDBM50478976
Substrate
Meas. Tech.
ChEMBL_490007 (CHEMBL984670)
Kd
100±n/a nM
Citation
 Marchand, BWhite, KLLy, JKMargot, NAWang, RMcDermott, MMiller, MDGötte, M Effects of the translocation status of human immunodeficiency virus type 1 reverse transcriptase on the efficiency of excision of tenofovir. Antimicrob Agents Chemother 51:2911-9 (2007)  
Target
Name:
Reverse transcriptase
Synonyms:
Type:
Protein
Mol. Mass.:
29598.37
Organism:
Human immunodeficiency virus 1
Description:
Q9WKE8
Residue:
254
  
Inhibitor
Name:
BDBM50478976
Synonyms:
CHEMBL1162296 | ddAMP
Type:
Small organic molecule
Emp. Form.:
C10H14N5O5P
Mol. Mass.:
315.2224
SMILES:
Nc1ncnc2n(cnc12)[C@H]1CC[C@@H](COP(O)(O)=O)O1
: