Target
Dihydrofolate reductase
Ligand
BDBM18069
Substrate
Meas. Tech.
ChEBML_54543
Ki
1.3±n/a nM
Citation
 Kuyper, LFRoth, BBaccanari, DPFerone, RBeddell, CRChampness, JNStammers, DKDann, JGNorrington, FEBaker, DJGoodford, PJ Receptor-based design of dihydrofolate reductase inhibitors: comparison of crystallographically determined enzyme binding with enzyme affinity in a series of carboxy-substituted trimethoprim analogues. J Med Chem 25:1120-2 (1983)  
Target
Name:
Dihydrofolate reductase
Synonyms:
Dihydrofolate reductase (F31V) | dfrA17
Type:
Mol. Mass.:
17532.46
Organism:
Escherichia coli
Description:
Residue:
157
  
Inhibitor
Name:
BDBM18069
Synonyms:
5-[(3,4,5-trimethoxyphenyl)methyl]pyrimidine-2,4-diamine TMP Trimethoprim (TMP) | US10870625, Compound TMP
Type:
Small organic molecule
Emp. Form.:
C14H18N4O3
Mol. Mass.:
290.3177
SMILES:
COc1cc(Cc2cnc(N)nc2N)cc(OC)c1OC
: