Target
Penicillin-binding protein 1B
Ligand
BDBM50420259
Substrate
Meas. Tech.
ChEMBL_553662 (CHEMBL960455)
IC50
9140±n/a nM
Citation
 Davies, TAPage, MGShang, WAndrew, TKania, MBush, K Binding of ceftobiprole and comparators to the penicillin-binding proteins of Escherichia coli, Pseudomonas aeruginosa, Staphylococcus aureus, and Streptococcus pneumoniae. Antimicrob Agents Chemother 51:2621-4 (2007)  
Target
Name:
Penicillin-binding protein 1B
Synonyms:
CAZ10_03050 PBP-1b Penicillin-binding protein 1B | ponB
Type:
PROTEIN
Mol. Mass.:
85500.33
Organism:
Pseudomonas aeruginosa
Description:
ChEMBL_105732
Residue:
774
  
Inhibitor
Name:
BDBM50420259
Synonyms:
CEFTAZIDIME
Type:
Small organic molecule
Emp. Form.:
C22H22N6O7S2
Mol. Mass.:
546.576
SMILES:
CC(C)(O\N=C(/C(=O)N[C@H]1[C@H]2SCC(C[n+]3ccccc3)=C(N2C1=O)C([O-])=O)c1csc(N)n1)C(O)=O
: