Target
Reverse transcriptase protein
Ligand
BDBM2483
Substrate
Meas. Tech.
ChEMBL_516596 (CHEMBL988683)
Ki
1500±n/a nM
Citation
 Radi, MMaga, GAlongi, MAngeli, LSamuele, AZanoli, SBellucci, LTafi, ACasaluce, GGiorgi, GArmand-Ugon, MGonzalez, EEsté, JABaltzinger, MBec, GDumas, PEnnifar, EBotta, M Discovery of chiral cyclopropyl dihydro-alkylthio-benzyl-oxopyrimidine (S-DABO) derivatives as potent HIV-1 reverse transcriptase inhibitors with high activity against clinically relevant mutants. J Med Chem 52:840-51 (2009)  
Target
Name:
Reverse transcriptase protein
Synonyms:
Reverse Transcriptase Reverse Transcriptase (F61A)
Type:
Protein
Mol. Mass.:
30203.56
Organism:
Human immunodeficiency virus 1
Description:
Q9WJQ2
Residue:
259
  
Inhibitor
Name:
BDBM2483
Synonyms:
(4S)-6-chloro-4-(2-cyclopropylethynyl)-4-(trifluoromethyl)-2,4-dihydro-1H-3,1-benzoxazin-2-one DMP-266 Efavirenz L-743,726 | Sustiva
Type:
Small organic molecule
Emp. Form.:
C14H9ClF3NO2
Mol. Mass.:
315.675
SMILES:
FC(F)(F)[C@]1(OC(=O)Nc2ccc(Cl)cc12)C#CC1CC1
: