Target
Reverse transcriptase
Ligand
BDBM50478158
Substrate
Meas. Tech.
ChEMBL_543748 (CHEMBL1020339)
IC50
22000±n/a nM
Citation
 Frangeul, ABarral, KAlvarez, KCanard, B In vitro suppression of K65R reverse transcriptase-mediated tenofovir- and adefovir-5'-diphosphate resistance conferred by the boranophosphonate derivatives. Antimicrob Agents Chemother 51:3162-7 (2007)  
Target
Name:
Reverse transcriptase
Synonyms:
Type:
Protein
Mol. Mass.:
29598.37
Organism:
Human immunodeficiency virus 1
Description:
Q9WKE8
Residue:
254
  
Inhibitor
Name:
BDBM50478158
Synonyms:
Tenofovir diphospahte | tenofovir diphosphate
Type:
Small organic molecule
Emp. Form.:
C9H16N5O10P3
Mol. Mass.:
447.1721
SMILES:
C[C@@H](Cn1cnc2c(N)ncnc12)OCP(O)(=O)OP(O)(=O)OP(O)(O)=O
: