Target
Integrase
Ligand
BDBM50183273
Substrate
Meas. Tech.
ChEMBL_647172 (CHEMBL1217313)
IC50
15±n/a nM
Citation
 Ferro, SDe Luca, LBarreca, MLDe Grazia, SChrist, FDebyser, ZChimirri, A New chloro,fluorobenzylindole derivatives as integrase strand-transfer inhibitors (INSTIs) and their mode of action. Bioorg Med Chem 18:5510-8 (2010)  
Target
Name:
Integrase
Synonyms:
pol
Type:
PROTEIN
Mol. Mass.:
32203.43
Organism:
Human immunodeficiency virus 1
Description:
ChEMBL_106649
Residue:
288
  
Inhibitor
Name:
BDBM50183273
Synonyms:
(S)-6-(3-chloro-2-fluorobenzyl)-1-(1-hydroxy-3-methylbutan-2-yl)-7-methoxy-4-oxo-1,4-dihydroquinoline-3-carboxylic acid 6-(3-chloro-2-fluorobenzyl)-1-[(1S)-1-(hydroxymethyl)-2-methylpropyl]-7-methoxy-4-oxo-1,4-dihydroquinoline-3-carboxylic acid ELVITEGRAVIR
Type:
Small organic molecule
Emp. Form.:
C23H23ClFNO5
Mol. Mass.:
447.884
SMILES:
COc1cc2n(cc(C(O)=O)c(=O)c2cc1Cc1cccc(Cl)c1F)[C@H](CO)C(C)C
: