Target
Gamma-aminobutyric acid receptor subunit alpha-1/beta-2/gamma-2
Ligand
BDBM50482696
Substrate
Meas. Tech.
ChEMBL_659629 (CHEMBL1249063)
IC50
79±n/a nM
Citation
 Cheng, JJu, XL Homology modeling and atomic level binding study of GABA(A) receptor with novel enaminone amides. Eur J Med Chem 45:3595-600 (2010)  
Target
Name:
Gamma-aminobutyric acid receptor subunit alpha-1/beta-2/gamma-2
Synonyms:
GABA receptor alpha-1/beta-2/gamma-2 subunit GABAA Subunit α1β2γ2 | GABAA Subunit alpha-1, beta-2, gamma-2
Type:
Mol. Mass.:
Description:
ASSAY_ID of EBI is 69455
Components:
This complex has 3 components.
Component 1
Name:
Gamma-aminobutyric acid receptor subunit beta-2
Synonyms:
GBRB2_RAT Gabrb2 | Gamma-aminobutyric acid receptor subunit beta-2 (GABA(A) beta-2)
Type:
Enzyme
Mol. Mass.:
54648.97
Organism:
Rattus norvegicus (Rat)
Description:
P63138
Residue:
474
  
Component 2
Name:
Gamma-aminobutyric acid receptor subunit gamma-2
Synonyms:
GBRG2_RAT Gamma-aminobutyric acid receptor subunit gamma-2 (GABA(A) gamma-2)
Type:
Enzyme
Mol. Mass.:
54087.63
Organism:
Rattus norvegicus (Rat)
Description:
P18508
Residue:
466
  
Component 3
Name:
Gamma-aminobutyric acid receptor subunit alpha-1
Synonyms:
Benzodiazepine central GABA A Benzodiazepine GABA A Benzodiazepine Type II GABA A Benzodiazepine Type IIM GABA A Benzodiazepine omega2 GABA A alpha1 GABA receptor alpha-1 subunit GABA-PICROTOXIN Gabra-1 TBPS
Type:
Enzyme
Mol. Mass.:
51770.21
Organism:
Rattus norvegicus (Rat)
Description:
P62813
Residue:
455
  
Inhibitor
Name:
BDBM50482696
Synonyms:
CHEMBL229201
Type:
Small organic molecule
Emp. Form.:
C21H22Cl2N2O2
Mol. Mass.:
405.318
SMILES:
CCC(CC)NC(=O)C(=C/Nc1ccc(Cl)cc1)\C(=O)c1ccccc1Cl
: