Target
Thymidine phosphorylase
Ligand
BDBM50483636
Substrate
Meas. Tech.
ChEMBL_739793 (CHEMBL1762853)
IC50
103000±n/a nM
Citation
 Rajabi, MMansell, DFreeman, SBryce, RA Structure-activity relationship of 2,4,5-trioxoimidazolidines as inhibitors of thymidine phosphorylase. Eur J Med Chem 46:1165-71 (2011)  
Target
Name:
Thymidine phosphorylase
Synonyms:
TYPH_ECOLI Thymidine Phosphorylase (TP) tpp | ttg
Type:
Enzyme
Mol. Mass.:
47198.54
Organism:
Escherichia coli
Description:
Residue:
440
  
Inhibitor
Name:
BDBM50483636
Synonyms:
CHEBI:87273 | CHEMBL1762070
Type:
Small organic molecule
Emp. Form.:
C11H10N2O3
Mol. Mass.:
218.2087
SMILES:
O=C1NC(=O)C(=O)N1CCc1ccccc1
: