Target
Thymidine phosphorylase
Ligand
BDBM50483646
Substrate
Meas. Tech.
ChEMBL_739793 (CHEMBL1762853)
IC50
40000±n/a nM
Citation
 Rajabi, MMansell, DFreeman, SBryce, RA Structure-activity relationship of 2,4,5-trioxoimidazolidines as inhibitors of thymidine phosphorylase. Eur J Med Chem 46:1165-71 (2011)  
Target
Name:
Thymidine phosphorylase
Synonyms:
TYPH_ECOLI Thymidine Phosphorylase (TP) tpp | ttg
Type:
Enzyme
Mol. Mass.:
47198.54
Organism:
Escherichia coli
Description:
Residue:
440
  
Inhibitor
Name:
BDBM50483646
Synonyms:
CHEMBL1762078
Type:
Small organic molecule
Emp. Form.:
C14H15N3O4
Mol. Mass.:
289.2866
SMILES:
NC(=O)CCN1C(=O)N(CCc2ccccc2)C(=O)C1=O
: