Target
Prostaglandin E2 receptor EP3 subtype
Ligand
BDBM50384443
Substrate
Meas. Tech.
ChEMBL_744134 (CHEMBL1771833)
Ki
10.0±n/a nM
Citation
 Morales-Ramos, ÁILi, YHHilfiker, MMecom, JSEidam, PShi, DTseng, PSBrooks, CZhang, DWang, NJaworski, JPMorrow, DFries, HEdwards, RJin, J Structure-activity relationship studies of novel 3-oxazolidinedione-6-naphthyl-2-pyridinones as potent and orally bioavailable EP3 receptor antagonists. Bioorg Med Chem Lett 21:2806-11 (2011)  
Target
Name:
Prostaglandin E2 receptor EP3 subtype
Synonyms:
PE2R3_HUMAN PGE2-R Prostaglandin E2 receptor Prostaglandin E2 receptor EP3 subtype (EP3) Prostaglandin E2 receptor EP3D subtype (EP3D) | Prostanoid EP3 receptor
Type:
Enzyme
Mol. Mass.:
43335.03
Organism:
Homo sapiens (Human)
Description:
P43115
Residue:
390
  
Inhibitor
Name:
BDBM50384443
Synonyms:
CHEMBL1770317
Type:
Small organic molecule
Emp. Form.:
C21H18N2O4
Mol. Mass.:
362.3786
SMILES:
CC(C)C1(OC(O)=NC1=O)c1ccc([nH]c1=O)-c1ccc2ccccc2c1
: