Target
HIV-1 protease
Ligand
BDBM13934
Substrate
Meas. Tech.
ChEMBL_768437 (CHEMBL1832156)
IC50
4.0±n/a nM
Citation
 Makatini, MMPetzold, KSriharsha, SNNdlovu, NSoliman, MEHonarparvar, BParboosing, RNaidoo, AArvidsson, PISayed, YGovender, PMaguire, GEKruger, HGGovender, T Synthesis and structural studies of pentacycloundecane-based HIV-1 PR inhibitors: a hybrid 2D NMR and docking/QM/MM/MD approach. Eur J Med Chem 46:3976-85 (2011)  
Target
Name:
HIV-1 protease
Synonyms:
HIV-1 protease
Type:
PROTEIN
Mol. Mass.:
10795.19
Organism:
Human immunodeficiency virus
Description:
ChEMBL_118439
Residue:
99
  
Inhibitor
Name:
BDBM13934
Synonyms:
Atazanavir CGP 73547 Latazanavir methyl N-[(1S)-1-[[(2S,3S)-3-hydroxy-4-[[[(2S)-2-(methoxycarbonylamino)-3,3-dimethyl-butanoyl]amino]-[(4-pyridin-2-ylphenyl)methyl]amino]-1-phenyl-butan-2-yl]carbamoyl]-2,2-dimethyl-propyl]carbamate | methyl N-[(1S)-1-{[(2S,3S)-3-hydroxy-4-[(2S)-2-[(methoxycarbonyl)amino]-3,3-dimethyl-N'-{[4-(pyridin-2-yl)phenyl]methyl}butanehydrazido]-1-phenylbutan-2-yl]carbamoyl}-2,2-dimethylpropyl]carbamate
Type:
Small organic molecule
Emp. Form.:
C38H52N6O7
Mol. Mass.:
704.8555
SMILES:
COC(=O)N[C@H](C(=O)N[C@@H](Cc1ccccc1)[C@@H](O)CN(Cc1ccc(cc1)-c1ccccn1)NC(=O)[C@@H](NC(=O)OC)C(C)(C)C)C(C)(C)C
: