Target
Amyloid-beta precursor protein
Ligand
BDBM50481120
Substrate
Meas. Tech.
ChEMBL_828507 (CHEMBL2050034)
IC50
24±n/a nM
Citation
 Swahn, BMSandell, JPyring, DBergh, MJeppsson, FJuréus, ANeelissen, JJohnström, PSchou, MSvensson, S Synthesis and evaluation of pyridylbenzofuran, pyridylbenzothiazole and pyridylbenzoxazole derivatives as ¹?F-PET imaging agents for ?-amyloid plaques. Bioorg Med Chem Lett 22:4332-7 (2012)  
Target
Name:
Amyloid-beta precursor protein
Synonyms:
A4 ABPP AICD-50 AICD-59 AID(57) APP Alzheimer disease amyloid protein Amyloid beta Protein Amyloid beta protein Abeta(1-42) Amyloid intracellular domain 57 Amyloid protein (Abeta42b) Beta amyloid A4 protein Beta-APP42 Beta-amyloid protein 42 C83 CVAP Gamma Secretase Gamma-CTF(57) Gamma-secretase Gamma-secretase C-terminal fragment 57 P3(40) PN-II Protease nexin-II S-APP-beta Soluble APP-beta | beta-Amyloid Precursor Protein (APP)
Type:
Single-pass type I membrane protein
Mol. Mass.:
86890.41
Organism:
Homo sapiens (Human)
Description:
P05067
Residue:
770
  
Inhibitor
Name:
BDBM50481120
Synonyms:
Flutemetamol | [3H]-Flutemetamol
Type:
Small organic molecule
Emp. Form.:
C14H11FN2OS
Mol. Mass.:
274.313
SMILES:
CNc1ccc(cc1F)-c1nc2ccc(O)cc2s1
: