Target
Cytochrome P450 3A4/3A5
Ligand
BDBM50485473
Substrate
Meas. Tech.
ChEMBL_830585 (CHEMBL2061440)
IC50
1100±n/a nM
Citation
 Keenan, MAbbott, MJAlexander, PWArmstrong, TBest, WMBerven, BBotero, AChaplin, JHCharman, SAChatelain, Evon Geldern, TWKerfoot, MKhong, ANguyen, TMcManus, JDMorizzi, JRyan, EScandale, IThompson, RAWang, SZWhite, KL Analogues of fenarimol are potent inhibitors of Trypanosoma cruzi and are efficacious in a murine model of Chagas disease. J Med Chem 55:4189-204 (2012)  
Target
Name:
Cytochrome P450 3A4/3A5
Synonyms:
CYP3A-M
Type:
PROTEIN
Mol. Mass.:
Description:
Components:
This complex has 2 components.
Component 1
Name:
Cytochrome P450 3A4
Synonyms:
Albendazole monooxygenase CP3A4_HUMAN CYP3A4 CYPIIIA4 Cytochrome P450 3A4 (CYP3A4) Nifedipine oxidase Taurochenodeoxycholate 6-alpha-hydroxylase
Type:
Enzyme
Mol. Mass.:
57349.57
Organism:
Homo sapiens (Human)
Description:
Residue:
503
  
Component 2
Name:
Cytochrome P450 3A5
Synonyms:
CP3A5_HUMAN Cytochrome P450 3A5 | Cytochrome P450 3A5 (CYP3A5)
Type:
Protein
Mol. Mass.:
57118.00
Organism:
Homo sapiens (Human)
Description:
P20815
Residue:
502
  
Inhibitor
Name:
BDBM50485473
Synonyms:
CHEMBL1863499 | DNDI1336037
Type:
Small organic molecule
Emp. Form.:
C21H19ClFNO2
Mol. Mass.:
371.832
SMILES:
CC(C)Oc1ccc(cc1)C(O)(c1cccnc1)c1ccc(Cl)cc1F
: