Target
ATP-binding cassette sub-family C member 2
Ligand
BDBM50023198
Substrate
Meas. Tech.
ChEMBL_838314 (CHEMBL2076812)
Ki
41100±n/a nM
Citation
 Horikawa, MKato, YTyson, CASugiyama, Y The potential for an interaction between MRP2 (ABCC2) and various therapeutic agents: probenecid as a candidate inhibitor of the biliary excretion of irinotecan metabolites. Drug Metab Pharmacokinet 17:23-33 (2002)  
Target
Name:
ATP-binding cassette sub-family C member 2
Synonyms:
ATP-binding cassette sub-family C member 2 Canalicular multidrug resistance protein Cmoat MRP2_RAT Multidrug resistance-associated protein 2
Type:
PROTEIN
Mol. Mass.:
173415.22
Organism:
Rattus norvegicus
Description:
ChEMBL_1455464
Residue:
1541
  
Inhibitor
Name:
BDBM50023198
Synonyms:
8-[4-(4-phenylbutyloxy)benzoyl]amino-2-(tetrazol-5-yl)-4-oxo-4H-1-benzopyran N-(4-oxo-2-(1H-tetrazol-5-yl)-4H-chromen-8-yl)-4-(4-phenylbutoxy)benzamide N-[4-Oxo-2-(1H-tetrazol-5-yl)-4H-chromen-8-yl]-4-(4-phenyl-butoxy)-benzamide (ONO-RS-411) ONO-1078 | PRANLUKAST
Type:
Small organic molecule
Emp. Form.:
C27H23N5O4
Mol. Mass.:
481.5026
SMILES:
O=C(Nc1cccc2c1oc(cc2=O)-c1nnn[nH]1)c1ccc(OCCCCc2ccccc2)cc1
: