Target
Phenylethanolamine N-methyltransferase
Ligand
BDBM50029100
Substrate
Meas. Tech.
ChEMBL_152579 (CHEMBL759757)
IC50
300000±n/a nM
Citation
 Bondinell, WEChapin, FWGirard, GRKaiser, CKrog, AJPavloff, AMSchwartz, MSSilvestri, JSVaidya, PDLam, BLWellman, GRPendleton, RG Inhibitors of phenylethanolamine N-methyltransferase and epinephrine biosynthesis. 1. Chloro-substituted 1,2,3,4-tetrahydroisoquinolines. J Med Chem 23:506-11 (1980)  
Target
Name:
Phenylethanolamine N-methyltransferase
Synonyms:
Noradrenaline N-methyltransferase PNMT PNMTase | Phenylethanolamine N-Methyltransferase (PNMT)
Type:
Enzyme
Mol. Mass.:
30852.66
Organism:
Homo sapiens (Human)
Description:
Residue:
282
  
Inhibitor
Name:
BDBM50029100
Synonyms:
2-(4-Chloro-phenyl)-1-methyl-ethylamine para-chloroamphetamine
Type:
Small organic molecule
Emp. Form.:
C9H12ClN
Mol. Mass.:
169.651
SMILES:
CC(N)Cc1ccc(Cl)cc1
: