Target
Phenylethanolamine N-methyltransferase
Ligand
BDBM13014
Substrate
Meas. Tech.
ChEMBL_152587 (CHEMBL759765)
Ki
3±n/a nM
Citation
 Bondinell, WEChapin, FWGirard, GRKaiser, CKrog, AJPavloff, AMSchwartz, MSSilvestri, JSVaidya, PDLam, BLWellman, GRPendleton, RG Inhibitors of phenylethanolamine N-methyltransferase and epinephrine biosynthesis. 1. Chloro-substituted 1,2,3,4-tetrahydroisoquinolines. J Med Chem 23:506-11 (1980)  
Target
Name:
Phenylethanolamine N-methyltransferase
Synonyms:
Noradrenaline N-methyltransferase PNMT PNMTase | Phenylethanolamine N-Methyltransferase (PNMT)
Type:
Enzyme
Mol. Mass.:
30852.66
Organism:
Homo sapiens (Human)
Description:
Residue:
282
  
Inhibitor
Name:
BDBM13014
Synonyms:
7,8-Dichloro-1,2,3,4-tetrahydro-isoquinoline; hydrochloride CHEMBL287837 SKF 64139 | tetrahydroisoquinoline (THIQ) analogue
Type:
Small organic molecule
Emp. Form.:
C9H9Cl2N
Mol. Mass.:
202.08
SMILES:
Clc1ccc2CCNCc2c1Cl
: