Target
Solute carrier family 22 member 8
Ligand
BDBM50350468
Substrate
Meas. Tech.
ChEMBL_838483 (CHEMBL2076054)
IC50
90000±n/a nM
Citation
 Jung, KYTakeda, MShimoda, MNarikawa, STojo, AKim, DKChairoungdua, AChoi, BKKusuhara, HSugiyama, YSekine, TEndou, H Involvement of rat organic anion transporter 3 (rOAT3) in cephaloridine-induced nephrotoxicity: in comparison with rOAT1. Life Sci 70:1861-74 (2002)  
Target
Name:
Solute carrier family 22 member 8
Synonyms:
Oat3 S22A8_RAT rOat3
Type:
PROTEIN
Mol. Mass.:
59199.83
Organism:
Rattus norvegicus
Description:
ChEMBL_1482580
Residue:
536
  
Inhibitor
Name:
BDBM50350468
Synonyms:
CEFAMANDOLE
Type:
Small organic molecule
Emp. Form.:
C18H18N6O5S2
Mol. Mass.:
462.503
SMILES:
Cn1nnnc1SCC1=C(N2[C@H](SC1)[C@H](NC(=O)[C@H](O)c1ccccc1)C2=O)C(O)=O
: