Target
ATP-dependent translocase ABCB1
Ligand
BDBM18957
Substrate
Meas. Tech.
ChEMBL_838276 (CHEMBL2076224)
Ki
2100±n/a nM
Citation
 Yasuda, KLan, LBSanglard, DFuruya, KSchuetz, JDSchuetz, EG Interaction of cytochrome P450 3A inhibitors with P-glycoprotein. J Pharmacol Exp Ther 303:323-32 (2002)  
Target
Name:
ATP-dependent translocase ABCB1
Synonyms:
Abcb1a MDR1A_MOUSE Mdr3 P-glycoprotein 1 and 3 (MDR1a/MDR1b) Pgy-3 | Pgy3
Type:
Protein
Mol. Mass.:
140669.02
Organism:
Mus musculus (Mouse)
Description:
P21447
Residue:
1276
  
Inhibitor
Name:
BDBM18957
Synonyms:
(2-{4-[(2-butyl-1-benzofuran-3-yl)carbonyl]-2,6-diiodophenoxy}ethyl)diethylamine Amiodarone Cordarone cid_441325
Type:
Small organic molecule
Emp. Form.:
C25H29I2NO3
Mol. Mass.:
645.3116
SMILES:
CCCCc1oc2ccccc2c1C(=O)c1cc(I)c(OCCN(CC)CC)c(I)c1
: